Target
Retinoic acid receptor RXR-beta
Ligand
BDBM50141605
Substrate
Meas. Tech.
ChEBML_196588
Ki
9200±n/a nM
Citation
 Michellys, PYD'Arrigo, JGrese, TAKaranewsky, DSLeibowitz, MDMais, DAMapes, CMReifel-Miller, ARungta, DBoehm, MF Design, synthesis and structure-activity relationship of novel RXR-selective modulators. Bioorg Med Chem Lett 14:1593-8 (2004)  
Target
Name:
Retinoic acid receptor RXR-beta
Synonyms:
Nr2b2 Retinoid X receptor beta | Rxrb
Type:
PROTEIN
Mol. Mass.:
55877.78
Organism:
Mus musculus
Description:
ChEMBL_196588
Residue:
520
  
Inhibitor
Name:
BDBM50141605
Synonyms:
(E)-3-[7-(3,5-Diisopropyl-2-propoxy-phenyl)-benzofuran-2-yl]-but-2-enoic acid | CHEMBL41675
Type:
Small organic molecule
Emp. Form.:
C27H32O4
Mol. Mass.:
420.5406
SMILES:
CCCOc1c(cc(cc1-c1cccc2cc(oc12)C(\C)=C\C(O)=O)C(C)C)C(C)C
: