Target
Acyl-protein thioesterase 1
Ligand
BDBM50578713
Substrate
Meas. Tech.
ChEMBL_2133972 (CHEMBL4843582)
IC50
0.320000±n/a nM
Citation
 ?imková, AOrmsby, TSidej, NSlav?tínská, LPBrynda, JBeranová, J?ácha, PMajer, PKonvalinka, J Structure-activity relationship and biochemical evaluation of novel fibroblast activation protein and prolyl endopeptidase inhibitors with ?-ketoamide warheads. Eur J Med Chem 224:0 (2021)  
Target
Name:
Acyl-protein thioesterase 1
Synonyms:
Acyl-protein thioesterase 1/2 LYPA1_RAT Lysosomal phospholipase A1
Type:
PROTEIN
Mol. Mass.:
24708.49
Organism:
Rattus norvegicus
Description:
ChEMBL_12731
Residue:
230
  
Inhibitor
Name:
BDBM50578713
Synonyms:
CHEMBL4868869
Type:
Small organic molecule
Emp. Form.:
C24H27N5O6
Mol. Mass.:
481.5011
SMILES:
O=C(CNC(=O)c1ccnc2ccccc12)N1CCC[C@H]1C(=O)C(=O)NCC(=O)N1CCOCC1
: