Target
Retinoic acid receptor RXR-alpha
Ligand
BDBM50146331
Substrate
Meas. Tech.
ChEMBL_196624 (CHEMBL800659)
Ki
1.6±n/a nM
Citation
 Gernert, DLNeel, DABoehm, MFLeibowitz, MDMais, DAMichellys, PYRungta, DReifel-Miller, AGrese, TA Design and synthesis of benzofused heterocyclic RXR modulators. Bioorg Med Chem Lett 14:2759-63 (2004)  
Target
Name:
Retinoic acid receptor RXR-alpha
Synonyms:
NR2B1 Nuclear receptor subfamily 4 group A member 2 RXRA Retinoic acid receptor RXR-alpha/gamma Retinoid receptor
Type:
PROTEIN
Mol. Mass.:
50820.38
Organism:
Homo sapiens (Human)
Description:
ChEMBL_1456363
Residue:
462
  
Inhibitor
Name:
BDBM50146331
Synonyms:
(E)-3-{3-[3,5-Di-tert-butyl-2-(2,2-difluoro-ethoxy)-phenyl]-1H-indol-5-yl}-but-2-enoic acid | CHEMBL430651
Type:
Small organic molecule
Emp. Form.:
C28H33F2NO3
Mol. Mass.:
469.5633
SMILES:
C\C(=C/C(O)=O)c1ccc2[nH]cc(-c3cc(cc(c3OCC(F)F)C(C)(C)C)C(C)(C)C)c2c1
: