Target
Pantetheinase
Ligand
BDBM480934
Substrate
Meas. Tech.
ChEMBL_2162813 (CHEMBL5047674)
IC50
0.680000±n/a nM
Citation
 Casimiro-Garcia, AAllais, CBrennan, AChoi, CDower, GFarley, KAFleming, MFlick, AFrisbie, RKHall, JHepworth, DJones, HKnafels, JDKortum, SLovering, FEMathias, JPMohan, SMorgan, PMParng, CParris, KPullen, NSchlerman, FStansfield, JStrohbach, JWVajdos, FFVincent, FWang, HWang, XWebster, RWright, SW Discovery of a Series of Pyrimidine Carboxamides as Inhibitors of Vanin-1. J Med Chem 65:757-784 (2022)  
Target
Name:
Pantetheinase
Synonyms:
Pantetheine hydrolase VNN1 Vanin-1 | Vascular non-inflammatory molecule 1
Type:
Enzyme Catalytic Domain
Mol. Mass.:
57002.46
Organism:
Homo sapiens (Human)
Description:
O95497
Residue:
513
  
Inhibitor
Name:
BDBM480934
Synonyms:
US10906888, Example 149
Type:
Small organic molecule
Emp. Form.:
C19H24N6O2
Mol. Mass.:
368.4329
SMILES:
C[C@H](Nc1ncc(cn1)C(=O)N1CCC2(C1)CCOCC2)c1cncnc1
: