Target
DNA excision repair protein ERCC-5
Ligand
BDBM50157846
Substrate
Meas. Tech.
ChEMBL_305129 (CHEMBL832425)
IC50
0.128±n/a nM
Citation
 Tumey, LNBom, DHuck, BGleason, EWang, JSilver, DBrunden, KBoozer, SRundlett, SSherf, BMurphy, SDent, TLeventhal, CBailey, AHarrington, JBennani, YL The identification and optimization of a N-hydroxy urea series of flap endonuclease 1 inhibitors. Bioorg Med Chem Lett 15:277-81 (2004)  
Target
Name:
DNA excision repair protein ERCC-5
Synonyms:
ERCC5 ERCM2 XPGC
Type:
PROTEIN
Mol. Mass.:
133069.11
Organism:
Homo sapiens (Human)
Description:
ChEMBL_305129
Residue:
1186
  
Inhibitor
Name:
BDBM50157846
Synonyms:
3-Hydroxy-7-p-tolyl-1H-furo[3,2-d]pyrimidine-2,4-dione | CHEMBL182381
Type:
Small organic molecule
Emp. Form.:
C13H10N2O4
Mol. Mass.:
258.2295
SMILES:
Cc1ccc(cc1)-c1coc2c1[nH]c(=O)n(O)c2=O
: