Target
Cytochrome P450 26A1
Ligand
BDBM50162791
Substrate
Meas. Tech.
ChEMBL_305304 (CHEMBL832851)
IC50
6±n/a nM
Citation
 Mulvihill, MJKan, JLBeck, PBittner, MCesario, CCooke, AKeane, DMNigro, AINillson, CSmith, VSrebernak, MSun, FLVrkljan, MWinski, SLCastelhano, ALEmerson, DGibson, N Potent and selective [2-imidazol-1-yl-2-(6-alkoxy-naphthalen-2-yl)-1-methyl-ethyl]-dimethyl-amines as retinoic acid metabolic blocking agents (RAMBAs). Bioorg Med Chem Lett 15:1669-73 (2005)  
Target
Name:
Cytochrome P450 26A1
Synonyms:
CP26A_HUMAN CYP26A1 Cytochrome P450 26A1 P450RAI1 | Retinoic acid 4-hydroxylase
Type:
Enzyme
Mol. Mass.:
56216.16
Organism:
Homo sapiens (Human)
Description:
O43174
Residue:
497
  
Inhibitor
Name:
BDBM50162791
Synonyms:
4-[6-(2-Dimethylamino-1-imidazol-1-yl-propyl)-naphthalen-2-yloxymethyl]-benzonitrile | CHEMBL359627
Type:
Small organic molecule
Emp. Form.:
C26H26N4O
Mol. Mass.:
410.5108
SMILES:
CC(C(c1ccc2cc(OCc3ccc(cc3)C#N)ccc2c1)n1ccnc1)N(C)C
: