Target
Growth factor receptor-bound protein 2
Ligand
BDBM50139762
Substrate
Meas. Tech.
ChEMBL_305462 (CHEMBL830958)
IC50
15±n/a nM
Citation
 Kang, SUShi, ZDWorthy, KMBindu, LKDharmawardana, PGChoyke, SJBottaro, DPFisher, RJBurke, TR Examination of phosphoryl-mimicking functionalities within a macrocyclic Grb2 SH2 domain-binding platform. J Med Chem 48:3945-8 (2005)  
Target
Name:
Growth factor receptor-bound protein 2
Synonyms:
ASH GRB2 adapter protein Grb2-SH2 | Growth factor receptor-bound protein 2
Type:
Protein
Mol. Mass.:
25205.04
Organism:
Homo sapiens (Human)
Description:
P62993
Residue:
217
  
Inhibitor
Name:
BDBM50139762
Synonyms:
CHEMBL349373 [(E)-(R)-18-Carbamoylmethyl-14-(5-methyl-indol-1-ylmethyl)-8,20-dioxo-17-(S)-oxo-10-((1S,4S)-4-phosphonomethyl-phenyl)-7,16,19-triaza-spiro[5.14]icos-11-en-9-yl]-acetic acid
Type:
Small organic molecule
Emp. Form.:
C38H48N5O9P
Mol. Mass.:
749.7896
SMILES:
Cc1ccc2n(C[C@H]3CNC(=O)[C@H](CC(N)=O)NC(=O)C4(CCCCC4)NC(=O)[C@@H](CC(O)=O)[C@H](\C=C\C3)c3ccc(CP(O)(O)=O)cc3)ccc2c1
: