Target
Cytochrome P450 26A1
Ligand
BDBM50183229
Substrate
Meas. Tech.
ChEMBL_355279 (CHEMBL853200)
IC50
1.6±n/a nM
Citation
 Mulvihill, MJKan, JLCooke, ABhagwat, SBeck, PBittner, MCesario, CKeane, DLazarescu, VNigro, ANillson, CPanicker, BSmith, VSrebernak, MSun, FLO'Connor, MRusso, SFischetti, GVrkljan, MWinski, SCastelhano, ALEmerson, DGibson, NW 3-[6-(2-Dimethylamino-1-imidazol-1-yl-butyl)-naphthalen-2-yloxy]-2,2-dimethyl-propionic acid as a highly potent and selective retinoic acid metabolic blocking agent. Bioorg Med Chem Lett 16:2729-33 (2006)  
Target
Name:
Cytochrome P450 26A1
Synonyms:
CP26A_HUMAN CYP26A1 Cytochrome P450 26A1 P450RAI1 | Retinoic acid 4-hydroxylase
Type:
Enzyme
Mol. Mass.:
56216.16
Organism:
Homo sapiens (Human)
Description:
O43174
Residue:
497
  
Inhibitor
Name:
BDBM50183229
Synonyms:
1-((6-((1R,2R)-1-(1H-imidazol-1-yl)-2-(isopropyl(methyl)amino)propyl)naphthalen-2-yloxy)methyl)cyclopentanecarboxylic acid | CHEMBL207304
Type:
Small organic molecule
Emp. Form.:
C27H35N3O3
Mol. Mass.:
449.5851
SMILES:
CC(C)N(C)[C@H](C)[C@@H](c1ccc2cc(OCC3(CCCC3)C(O)=O)ccc2c1)n1ccnc1
: