Target
Melanin-concentrating hormone receptor 1
Ligand
BDBM50203054
Substrate
Meas. Tech.
ChEMBL_435559 (CHEMBL903918)
Ki
7±n/a nM
Citation
 Méndez-Andino, JLColson, AOMeyers, KMMitchell, MCHodge, KHoward, JMKim, NAckley, DCHolbert, JKMittelstadt, SWDowty, MEObringer, CMSuchanek, PReizes, OHu, XEWos, JA The efficacy and cardiac evaluation of aminomethyl tetrahydronaphthalene ketopiperazines: a novel class of potent MCH-R1 antagonists. Bioorg Med Chem 15:2092-105 (2007)  
Target
Name:
Melanin-concentrating hormone receptor 1
Synonyms:
G-protein coupled receptor 24 MCH receptor 1 MCH-R1 MCHR-1 MCHR1_HUMAN Melanin-Concentrating Hormone Receptor 1 (MCH1R) Melanin-concentrating hormone receptor 1 (MCH-1) Melanin-concentrating hormone receptor 1 (MCHR-1) SLC-1 Somatostatin receptor-like protein
Type:
G Protein-Coupled Receptor (GPCR)
Mol. Mass.:
45976.27
Organism:
Homo sapiens (Human)
Description:
Membranes from CHO-K1 cells stably expressing human MCH1R were used in assays.
Residue:
422
  
Inhibitor
Name:
BDBM50203054
Synonyms:
4'-fluoro-biphenyl-4-carboxylic acid [2-(4-dimethylaminomethyl-phenyl)-ethyl]-methyl-amide | CHEMBL229093
Type:
Small organic molecule
Emp. Form.:
C25H27FN2O
Mol. Mass.:
390.4931
SMILES:
CN(C)Cc1ccc(CCN(C)C(=O)c2ccc(cc2)-c2ccc(F)cc2)cc1
: