Target
Retinoic acid receptor RXR-beta
Ligand
BDBM50256124
Substrate
Meas. Tech.
ChEMBL_515110 (CHEMBL1024632)
IC50
>10000±n/a nM
Citation
 Morishita, KYakushiji, NOhsawa, FTakamatsu, KMatsuura, NMakishima, MKawahata, MYamaguchi, KTai, ASasaki, KKakuta, H Replacing alkyl sulfonamide with aromatic sulfonamide in sulfonamide-type RXR agonists favors switch towards antagonist activity. Bioorg Med Chem Lett 19:1001-3 (2009)  
Target
Name:
Retinoic acid receptor RXR-beta
Synonyms:
NR2B2 RXRB Retinoic acid receptor RXR-beta Retinoid receptor
Type:
PROTEIN
Mol. Mass.:
56932.89
Organism:
Homo sapiens (Human)
Description:
ChEMBL_39045
Residue:
533
  
Inhibitor
Name:
BDBM50256124
Synonyms:
6-(N-(5,5,8,8-tetramethyl-5,6,7,8-tetrahydronaphthalen-2-yl)phenylsulfonamido)nicotinic acid | CHEMBL515426
Type:
Small organic molecule
Emp. Form.:
C26H28N2O4S
Mol. Mass.:
464.577
SMILES:
CC1(C)CCC(C)(C)c2cc(ccc12)N(c1ccc(cn1)C(O)=O)S(=O)(=O)c1ccccc1
: