Target
Retinoic acid receptor RXR-beta
Ligand
BDBM50285917
Substrate
Meas. Tech.
ChEBML_197054
EC50
130±n/a nM
Citation
 Beard, RLColon, DFKlein, ESVorse, KAChandraratna, RA Differential RXR & RAR activity of stilbene retinoid analogs bearing thiazole and imidazole carboxylic acids Bioorg Med Chem Lett 5:2729-2734 (1995)    Article 
Target
Name:
Retinoic acid receptor RXR-beta
Synonyms:
NR2B2 RXRB Retinoic acid receptor RXR-beta Retinoid receptor
Type:
PROTEIN
Mol. Mass.:
56932.89
Organism:
Homo sapiens (Human)
Description:
ChEMBL_39045
Residue:
533
  
Inhibitor
Name:
BDBM50285917
Synonyms:
2-[(E)-2-(3,5,5,8,8-Pentamethyl-5,6,7,8-tetrahydro-naphthalen-2-yl)-propenyl]-3H-imidazole-4-carboxylic acid | CHEMBL329802
Type:
Small organic molecule
Emp. Form.:
C22H28N2O2
Mol. Mass.:
352.4699
SMILES:
CC(=Cc1ncc([nH]1)C(O)=O)c1cc2c(cc1C)C(C)(C)CCC2(C)C
: