Target
Retinoic acid receptor gamma
Ligand
BDBM50285919
Substrate
Meas. Tech.
ChEBML_195985
EC50
200±n/a nM
Citation
 Beard, RLColon, DFKlein, ESVorse, KAChandraratna, RA Differential RXR & RAR activity of stilbene retinoid analogs bearing thiazole and imidazole carboxylic acids Bioorg Med Chem Lett 5:2729-2734 (1995)    Article 
Target
Name:
Retinoic acid receptor gamma
Synonyms:
NR1B3 RAR-gamma RARG_HUMAN Retinoic acid receptor gamma | Retinoid receptor
Type:
PROTEIN
Mol. Mass.:
50345.43
Organism:
Homo sapiens (Human)
Description:
ChEMBL_1458016
Residue:
454
  
Inhibitor
Name:
BDBM50285919
Synonyms:
2-[(E)-2-(3,5,5,8,8-Pentamethyl-5,6,7,8-tetrahydro-naphthalen-2-yl)-propenyl]-thiazole-5-carboxylic acid | CHEMBL328481
Type:
Small organic molecule
Emp. Form.:
C22H27NO2S
Mol. Mass.:
369.52
SMILES:
C\C(=C/c1ncc(s1)C(O)=O)c1cc2c(cc1C)C(C)(C)CCC2(C)C
: