Target
Adenosine deaminase
Ligand
BDBM28393
Substrate
Meas. Tech.
ChEBML_30813
Ki
1.1±n/a nM
Citation
 Pragnacharyulu, PVLu, PJAbushanab, E Adenosine deaminase inhibitors. Synthesis and biological evaluation of chain modified analogs of (+)-EHNA Bioorg Med Chem Lett 6:2417-2420 (1996)    Article 
Target
Name:
Adenosine deaminase
Synonyms:
ADA Adenosine aminohydrolase
Type:
Enzyme
Mol. Mass.:
40910.44
Organism:
Bos taurus (bovine)
Description:
Residue:
363
  
Inhibitor
Name:
BDBM28393
Synonyms:
(+)-EHNA CHEMBL296435
Type:
Small organic molecule
Emp. Form.:
C14H23N5O
Mol. Mass.:
277.3653
SMILES:
CCCCCC[C@H]([C@H](C)O)n1cnc2c(N)ncnc12
: