Target
Retinoic acid receptor alpha
Ligand
BDBM50290181
Substrate
Meas. Tech.
ChEBML_195466
Kd
>1000±n/a nM
Citation
 Beard, RLTeng, MColon, DFDuong, TTThacher, SMArefieg, TChandraratna, RA Synthesis and biological activity of 1,2,3,4-tetrahydroquinoline and 3,4-(1H)-dihydroquinolin-2-one analogs of retinoic acid Bioorg Med Chem Lett 7:2373-2378 (1997)    Article 
Target
Name:
Retinoic acid receptor alpha
Synonyms:
NR1B1 RAR-alpha RARA_HUMAN Retinoic acid receptor alpha/Retinoid X receptor alpha Retinoid receptor
Type:
PROTEIN
Mol. Mass.:
50778.87
Organism:
Homo sapiens (Human)
Description:
ChEMBL_1466191
Residue:
462
  
Inhibitor
Name:
BDBM50290181
Synonyms:
4-(1-Heptyl-4,4-dimethyl-1,2,3,4-tetrahydro-quinolin-6-ylethynyl)-benzoic acid | CHEMBL308967
Type:
Small organic molecule
Emp. Form.:
C27H33NO2
Mol. Mass.:
403.5564
SMILES:
CCCCCCCN1CCC(C)(C)c2cc(ccc12)C#Cc1ccc(cc1)C(O)=O
: