Target
Retinoic acid receptor RXR-beta
Ligand
BDBM50032675
Substrate
Meas. Tech.
ChEMBL_197071 (CHEMBL806660)
Ki
21±n/a nM
Citation
 Farmer, LJJeong, SKallel, EAKoch, SSCroston, GEFlatten, KSHeyman, RANadzan, AM Synthesis and structure-activity relationships of potent retinoid X receptor ligands Bioorg Med Chem Lett 7:2393-2398 (1997)    Article 
Target
Name:
Retinoic acid receptor RXR-beta
Synonyms:
Nr2b2 Retinoid X receptor beta | Rxrb
Type:
PROTEIN
Mol. Mass.:
55877.78
Organism:
Mus musculus
Description:
ChEMBL_196588
Residue:
520
  
Inhibitor
Name:
BDBM50032675
Synonyms:
4-[1-(3,5,5,8,8-pentamethyl-5,6,7,8-tetrahydronaphthalen-2-yl)vinyl]benzoic acid CHEMBL1023 | p-(1-(5,6,7,8-Tetrahydro-3,5,5,8,8-pentamethyl-2-naphthyl)vinyl)benzoic acid
Type:
Small organic molecule
Emp. Form.:
C24H28O2
Mol. Mass.:
348.4779
SMILES:
Cc1cc2c(cc1C(=C)c1ccc(cc1)C(O)=O)C(C)(C)CCC2(C)C
: