Target
Sucrase-isomaltase, intestinal
Ligand
BDBM50291035
Substrate
Meas. Tech.
ChEMBL_206289 (CHEMBL808826)
Ki
350±n/a nM
Citation
 Lesur, BDucep, JBLalloz, MNEhrhard, ADanzin, C New deoxynojirimycin derivatives as potent inhibitors of intestinal α-glucohydrolases Bioorg Med Chem Lett 7:355-360 (1997)    Article 
Target
Name:
Sucrase-isomaltase, intestinal
Synonyms:
SUIS_RAT Sucrase-isomaltase | alpha-Glucosidase (α-Glucosidase)
Type:
Enzyme
Mol. Mass.:
210329.04
Organism:
Rattus norvegicus (Rat)
Description:
P23739
Residue:
1841
  
Inhibitor
Name:
BDBM50291035
Synonyms:
(2R,3R,4R,5S)-2-Hydroxymethyl-1-((Z)-3-trimethylsilanyl-allyl)-piperidine-3,4,5-triol | CHEMBL332468
Type:
Small organic molecule
Emp. Form.:
C12H25NO4Si
Mol. Mass.:
275.4167
SMILES:
C[Si](C)(C)\C=C/CN1C[C@H](O)[C@@H](O)[C@H](O)[C@H]1CO
: