Target
Retinoic acid receptor beta
Ligand
BDBM50296049
Substrate
Meas. Tech.
ChEMBL_579373 (CHEMBL1063214)
IC50
40±n/a nM
Citation
 Sun, WCarroll, PJSoprano, DRCanney, DJ Identification of a chromone-based retinoid containing a polyolefinic side chain via facile synthetic routes. Bioorg Med Chem Lett 19:4339-42 (2009)  
Target
Name:
Retinoic acid receptor beta
Synonyms:
HAP NR1B2 RAR-beta RARB Retinoic acid receptor RXR-alpha/Retinoic acid receptor beta Retinoid receptor
Type:
PROTEIN
Mol. Mass.:
50498.70
Organism:
Homo sapiens (Human)
Description:
ChEMBL_1458015
Residue:
455
  
Inhibitor
Name:
BDBM50296049
Synonyms:
(2E,4E)-2,4-dimethyl-5-(6,6,9,9-tetramethyl-4-oxo-6,7,8,9-tetrahydro-4H-benzo[g]chromen-3-yl)penta-2,4-dienoic acid | CHEMBL550796
Type:
Small organic molecule
Emp. Form.:
C24H28O4
Mol. Mass.:
380.4767
SMILES:
C\C(\C=C(/C)C(O)=O)=C/c1coc2cc3c(cc2c1=O)C(C)(C)CCC3(C)C
: