Target
TGF-beta receptor type-1
Ligand
BDBM50304861
Substrate
Meas. Tech.
ChEMBL_606316 (CHEMBL1070008)
Ki
440±n/a nM
Citation
 Guckian, KCarter, MBLin, EYChoi, MSun, LBoriack-Sjodin, PAChuaqui, CLane, BCheung, KLing, LLee, WC Pyrazolone based TGFbetaR1 kinase inhibitors. Bioorg Med Chem Lett 20:326-9 (2010)  
Target
Name:
TGF-beta receptor type-1
Synonyms:
ALK-5 Activin A receptor type II-like protein kinase of 53kD SKR4 TGF-beta receptor type I TGFBR1 TGFR1_HUMAN Transforming growth factor-beta receptor type I
Type:
enzyme
Mol. Mass.:
55968.24
Organism:
Homo sapiens (Human)
Description:
P36897
Residue:
503
  
Inhibitor
Name:
BDBM50304861
Synonyms:
CHEMBL593950 | methyl 3-(1,2-dimethyl-3-oxo-5-(quinoxalin-6-yl)-2,3-dihydro-1H-pyrazol-4-yl)benzoate
Type:
Small organic molecule
Emp. Form.:
C21H18N4O3
Mol. Mass.:
374.3926
SMILES:
COC(=O)c1cccc(c1)-c1c(-c2ccc3nccnc3c2)n(C)n(C)c1=O
: