Target
Ribonuclease pancreatic
Ligand
BDBM50292723
Substrate
Meas. Tech.
ChEMBL_620094 (CHEMBL1109349)
pH
6±n/a
Ki
11600±n/a nM
Comments
extracted
Citation
 Dossi, KTsirkone, VGHayes, JMMatousek, JPoucková, PSoucek, JZadinova, MZographos, SELeonidas, DD Mapping the ribonucleolytic active site of bovine seminal ribonuclease. The binding of pyrimidinyl phosphonucleotide inhibitors. Eur J Med Chem 44:4496-508 (2009)  
Target
Name:
Ribonuclease pancreatic
Synonyms:
CAM-RNase A RNASE1 RNS1
Type:
Enzyme
Mol. Mass.:
16468.79
Organism:
Bison bison (American bison)
Description:
carboxamidomethylated RNase A
Residue:
150
  
Inhibitor
Name:
BDBM50292723
Synonyms:
(2R,3R,4R,5R)-2-(2,4-dioxo-3,4-dihydropyrimidin-1(2H)-yl)-4-hydroxy-5-(hydroxymethyl)tetrahydrofuran-3-yl dihydrogen phosphate PHOSPHORIC ACID MONO-[2-(2,4-DIOXO-3,4-DIHYDRO-2H-PYRIMIDIN-1-YL)-4-HYDROXY-5-HYDROXYMETHYL-TETRAHYDRO-FURAN-3-YL] ESTER | uridine 2'-phosphate
Type:
Small organic molecule
Emp. Form.:
C9H13N2O9P
Mol. Mass.:
324.1813
SMILES:
OC[C@H]1O[C@H]([C@H](OP(O)(O)=O)[C@@H]1O)n1ccc(=O)[nH]c1=O
: