Target
Sodium-dependent noradrenaline transporter
Ligand
BDBM50319579
Substrate
Meas. Tech.
ChEMBL_634326 (CHEMBL1120739)
IC50
2±n/a nM
Citation
 O'Neill, DJAdedoyin, AAlfinito, PDBray, JACosmi, SDeecher, DCFensome, AHarrison, JLeventhal, LMann, CMcComas, CCSullivan, NRSpangler, TBUveges, AJTrybulski, EJWhiteside, GTZhang, P Discovery of novel selective norepinephrine reuptake inhibitors: 4-[3-aryl-2,2-dioxido-2,1,3-benzothiadiazol-1(3H)-yl]-1-(methylamino)butan-2-ols (WYE-103231). J Med Chem 53:4511-21 (2010)  
Target
Name:
Sodium-dependent noradrenaline transporter
Synonyms:
Monoamine transporter NET Noradrenaline Transporter (NET) Norepinephrine transporter protein (NET) SLC6A2 Sodium-dependent noradrenaline transporter (NET) | Solute carrier family 6 member 2
Type:
Multi-pass membrane protein
Mol. Mass.:
69337.72
Organism:
Homo sapiens (Human)
Description:
P23975
Residue:
617
  
Inhibitor
Name:
BDBM50319579
Synonyms:
4-(2,2-Dioxido-3-phenyl-2,1,3-benzothiadiazol-1(3H)-yl)-1-(methylamino)butan-2-ol | CHEMBL1083393
Type:
Small organic molecule
Emp. Form.:
C17H21N3O3S
Mol. Mass.:
347.432
SMILES:
CNCC(O)CCN1c2ccccc2N(c2ccccc2)S1(=O)=O
: