Target
Sodium-dependent dopamine transporter
Ligand
BDBM50005536
Substrate
Meas. Tech.
ChEMBL_634325 (CHEMBL1120738)
Ki
22.1±n/a nM
Citation
 O'Neill, DJAdedoyin, AAlfinito, PDBray, JACosmi, SDeecher, DCFensome, AHarrison, JLeventhal, LMann, CMcComas, CCSullivan, NRSpangler, TBUveges, AJTrybulski, EJWhiteside, GTZhang, P Discovery of novel selective norepinephrine reuptake inhibitors: 4-[3-aryl-2,2-dioxido-2,1,3-benzothiadiazol-1(3H)-yl]-1-(methylamino)butan-2-ols (WYE-103231). J Med Chem 53:4511-21 (2010)  
Target
Name:
Sodium-dependent dopamine transporter
Synonyms:
DA transporter DAT1 Dopamine transporter protein (DAT) SC6A3_HUMAN Sodium-dependent dopamine transporter Solute carrier family 6 member 3
Type:
Multi-pass membrane protein
Mol. Mass.:
68497.11
Organism:
Homo sapiens (Human)
Description:
Q01959
Residue:
620
  
Inhibitor
Name:
BDBM50005536
Synonyms:
42-548 5-(4-chlorophenyl)-3,5-dihydro-2H-imidazo[2,1-a]isoindol-5-ol CHEMBL781 Mazanor mazindole
Type:
Small organic molecule
Emp. Form.:
C16H13ClN2O
Mol. Mass.:
284.74
SMILES:
OC1(N2CCN=C2c2ccccc12)c1ccc(Cl)cc1
: