Target
Delta-type opioid receptor
Ligand
BDBM50179191
Substrate
Meas. Tech.
ChEMBL_647233 (CHEMBL1217374)
Ki
0.035±n/a nM
Citation
 Balboni, GMarzola, ESasaki, YAmbo, AMarczak, EDLazarus, LHSalvadori, S Role of 2',6'-dimethyl-l-tyrosine (Dmt) in some opioid lead compounds. Bioorg Med Chem 18:6024-30 (2010)  
Target
Name:
Delta-type opioid receptor
Synonyms:
Cytochrome P450 3A4 Delta opioid receptor Delta-type opioid receptor (DOR) OPRD_RAT Opioid receptor Opioid receptors; mu & delta Ror-a | Voltage-gated potassium channel
Type:
G Protein-Coupled Receptor (GPCR)
Mol. Mass.:
40465.04
Organism:
Rattus norvegicus (rat)
Description:
Competition binding assays were using CHO-K1 cell membranes expressing the opioid receptor.
Residue:
372
  
Inhibitor
Name:
BDBM50179191
Synonyms:
(S)-N-((1H-benzo[d]imidazol-2-yl)methyl)-2-((S)-2-amino-3-(4-hydroxy-2,6-dimethylphenyl)propanoyl)-1,2,3,4-tetrahydroisoquinoline-3-carboxamide CHEMBL109390 UFP-502
Type:
Small organic molecule
Emp. Form.:
C29H31N5O3
Mol. Mass.:
497.5881
SMILES:
Cc1cc(O)cc(C)c1C[C@H](N)C(=O)N1Cc2ccccc2C[C@H]1C(=O)NCc1nc2ccccc2[nH]1
: