Target
Bile acid receptor
Ligand
BDBM50336377
Substrate
Meas. Tech.
ChEMBL_716784 (CHEMBL1670706)
IC50
8±n/a nM
Citation
 Richter, HGBenson, GMBleicher, KHBlum, DChaput, EClemann, NFeng, SGardes, CGrether, UHartman, PKuhn, BMartin, REPlancher, JMRudolph, MGSchuler, FTaylor, S Optimization of a novel class of benzimidazole-based farnesoid X receptor (FXR) agonists to improve physicochemical and ADME properties. Bioorg Med Chem Lett 21:1134-40 (2011)  
Target
Name:
Bile acid receptor
Synonyms:
BAR FXR HRR1 NR1H4_HUMAN RIP14 Retinoid X receptor-interacting protein 14 | farnesoid x receptor
Type:
Nuclear Receptor
Mol. Mass.:
55916.24
Organism:
Homo sapiens (Human)
Description:
Q96RI1
Residue:
486
  
Inhibitor
Name:
BDBM50336377
Synonyms:
(S)-4-(2-(2-(4-chlorophenyl)-5,6-difluoro-1H-benzo[d]imidazol-1-yl)-2-cyclohexylacetamido)-3-(trifluoromethyl)benzoic acid | CHEMBL1668244
Type:
Small organic molecule
Emp. Form.:
C29H23ClF5N3O3
Mol. Mass.:
591.956
SMILES:
OC(=O)c1ccc(NC(=O)[C@H](C2CCCCC2)n2c(nc3cc(F)c(F)cc23)-c2ccc(Cl)cc2)c(c1)C(F)(F)F
: