Target
Tyrosine-protein phosphatase non-receptor type 1
Ligand
BDBM50152579
Substrate
Meas. Tech.
ChEMBL_743505 (CHEMBL1767946)
IC50
20000±n/a nM
Citation
 Vintonyak, VVWaldmann, HRauh, D Using small molecules to target protein phosphatases. Bioorg Med Chem 19:2145-55 (2011)  
Target
Name:
Tyrosine-protein phosphatase non-receptor type 1
Synonyms:
PTN1_HUMAN PTPN1 Protein tyrosine phosphatase-1B (PTP1B) Protein-tyrosine phosphatase 1B (PTP1B) Tyrosine-protein phosphatase non-receptor type 1 (PTP1B)
Type:
Protein phosphatase
Mol. Mass.:
49963.76
Organism:
Homo sapiens (Human)
Description:
Human recombinant GST-fusion PTP1B (1-435).
Residue:
435
  
Inhibitor
Name:
BDBM50152579
Synonyms:
4-(2-Fluoro-phenyl)-2,4-dioxo-butyric acid Sacchettini_2
Type:
Small organic molecule
Emp. Form.:
C10H7FO4
Mol. Mass.:
210.1586
SMILES:
OC(=O)C(=O)CC(=O)c1ccccc1F
: