Target
Ribonuclease pancreatic
Ligand
BDBM50342009
Substrate
Meas. Tech.
ChEMBL_743584 (CHEMBL1768084)
Ki
250000±n/a nM
Citation
 Samanta, ADasgupta, SPathak, T 5'-Modified pyrimidine nucleosides as inhibitors of ribonuclease A. Bioorg Med Chem 19:2478-84 (2011)  
Target
Name:
Ribonuclease pancreatic
Synonyms:
CAM-RNase A RNASE1 RNS1
Type:
Enzyme
Mol. Mass.:
16468.79
Organism:
Bison bison (American bison)
Description:
carboxamidomethylated RNase A
Residue:
150
  
Inhibitor
Name:
BDBM50342009
Synonyms:
5'-N-(4-Carboxypiperidinyl)-2',3'-didehydro-3',5'-dideoxythymidine | CHEMBL1765478
Type:
Small organic molecule
Emp. Form.:
C16H21N3O5
Mol. Mass.:
335.355
SMILES:
Cc1cn([C@@H]2O[C@H](CN3CCC(CC3)C(O)=O)C=C2)c(=O)[nH]c1=O
: