Target
Disintegrin and metalloproteinase domain-containing protein 17
Ligand
BDBM50342953
Substrate
Meas. Tech.
ChEMBL_744255 (CHEMBL1772062)
Ki
0.400000±n/a nM
Citation
 Dai, CLi, DPopovici-Muller, JZhao, LGirijavallabhan, VMRosner, KELavey, BJRizvi, RShankar, BBWong, MKGuo, ZOrth, PStrickland, COSun, JNiu, XChen, SKozlowski, JALundell, DJPiwinski, JJShih, NYSiddiqui, MA 2-(2-Aminothiazol-4-yl)pyrrolidine-based tartrate diamides as potent, selective and orally bioavailable TACE inhibitors. Bioorg Med Chem Lett 21:3172-6 (2011)  
Target
Name:
Disintegrin and metalloproteinase domain-containing protein 17
Synonyms:
ADA17_HUMAN CSVP Disintegrin and metalloproteinase domain-containing protein 17 (ADAM17) TNF-alpha convertase TNF-alpha-converting enzyme (TACE) Tumor necrosis factor-α converting enzyme (TACE)
Type:
Enzyme
Mol. Mass.:
93007.89
Organism:
Homo sapiens (Human)
Description:
Residue:
824
  
Inhibitor
Name:
BDBM50342953
Synonyms:
(2R,3R)-2,3-dihydroxy-4-{(2R)-2-[2-(methylamino)-5-(methylsulfonyl)-1,3-thiazol-4-yl]pyrrolidin-1-yl}-4-oxo-N-{(1R)-1-[4-(1H-pyrazol-1-yl)phenyl]ethyl}butanamide CHEMBL1738754
Type:
Small organic molecule
Emp. Form.:
C24H30N6O6S2
Mol. Mass.:
562.662
SMILES:
CNc1nc([C@H]2CCCN2C(=O)[C@H](O)[C@@H](O)C(=O)N[C@H](C)c2ccc(cc2)-n2cccn2)c(s1)S(C)(=O)=O
: