Target
Glucagon-like peptide 1 receptor
Ligand
BDBM50360598
Substrate
Meas. Tech.
ChEMBL_795447 (CHEMBL1937452)
Ki
816±n/a nM
Citation
 Filipski, KJBian, JEbner, DCLee, ECLi, JCSammons, MFWright, SWStevens, BDDidiuk, MTTu, MPerreault, CBrown, JAtkinson, KTan, BSalatto, CTLitchfield, JPfefferkorn, JAGuzman-Perez, A A novel series of glucagon receptor antagonists with reduced molecular weight and lipophilicity. Bioorg Med Chem Lett 22:415-20 (2011)  
Target
Name:
Glucagon-like peptide 1 receptor
Synonyms:
GLP-1 receptor GLP-1R GLP1R_HUMAN Glucagon-like peptide 1 receptor (GLP-1)
Type:
Enzyme
Mol. Mass.:
53035.78
Organism:
Homo sapiens (Human)
Description:
P43220
Residue:
463
  
Inhibitor
Name:
BDBM50360598
Synonyms:
CHEMBL1933364
Type:
Small organic molecule
Emp. Form.:
C24H22F6N4O3
Mol. Mass.:
528.4469
SMILES:
OC(=O)CCNC(=O)c1ccc(cc1)C(CCC(F)(F)F)Nc1cnn(c1)-c1ccc(cc1)C(F)(F)F
: