Target
Gastric inhibitory polypeptide receptor
Ligand
BDBM50360598
Substrate
Meas. Tech.
ChEMBL_795449 (CHEMBL1937454)
Ki
300±n/a nM
Citation
 Filipski, KJBian, JEbner, DCLee, ECLi, JCSammons, MFWright, SWStevens, BDDidiuk, MTTu, MPerreault, CBrown, JAtkinson, KTan, BSalatto, CTLitchfield, JPfefferkorn, JAGuzman-Perez, A A novel series of glucagon receptor antagonists with reduced molecular weight and lipophilicity. Bioorg Med Chem Lett 22:415-20 (2011)  
Target
Name:
Gastric inhibitory polypeptide receptor
Synonyms:
GIPR Gastric Inhibitory Polypeptide Receptor (GIPR) | Gastric inhibitory polypeptide receptor
Type:
PROTEIN
Mol. Mass.:
53173.82
Organism:
Homo sapiens (Human)
Description:
ChEMBL_1518286
Residue:
466
  
Inhibitor
Name:
BDBM50360598
Synonyms:
CHEMBL1933364
Type:
Small organic molecule
Emp. Form.:
C24H22F6N4O3
Mol. Mass.:
528.4469
SMILES:
OC(=O)CCNC(=O)c1ccc(cc1)C(CCC(F)(F)F)Nc1cnn(c1)-c1ccc(cc1)C(F)(F)F
: