Target
Retinoic acid receptor beta
Ligand
BDBM50048281
Substrate
Meas. Tech.
ChEBML_195497
Ki
13±n/a nM
Citation
 Diaz, PMichel, SStella, LCharpentier, B Synthesis and biological activities of new heterocyclic aromatic retinoids Bioorg Med Chem Lett 7:2289-2294 (1997)    Article 
Target
Name:
Retinoic acid receptor beta
Synonyms:
HAP NR1B2 RAR-beta RARB Retinoic acid receptor RXR-alpha/Retinoic acid receptor beta Retinoid receptor
Type:
PROTEIN
Mol. Mass.:
50498.70
Organism:
Homo sapiens (Human)
Description:
ChEMBL_1458015
Residue:
455
  
Inhibitor
Name:
BDBM50048281
Synonyms:
5',5',8',8'-Tetramethyl-5',6',7',8'-tetrahydro-[2,2']binaphthalenyl-6-carboxylic acid CHEMBL25361
Type:
Small organic molecule
Emp. Form.:
C25H26O2
Mol. Mass.:
358.4727
SMILES:
CC1(C)CCC(C)(C)c2cc(ccc12)-c1ccc2cc(ccc2c1)C(O)=O
: