Target
Vasopressin V2 receptor
Ligand
BDBM50108498
Substrate
Meas. Tech.
ChEMBL_211258 (CHEMBL885387)
Ki
1.2±n/a nM
Citation
 Kakefuda, ATsukada, JKusayama, TTahara, ATsukamoto, S N-Methylbenzanilide derivatives as a novel class of selective V(1A) receptor antagonists. Bioorg Med Chem Lett 12:229-32 (2001)  
Target
Name:
Vasopressin V2 receptor
Synonyms:
AVPR V2 Avpr2 V2R_RAT Vasopressin receptor
Type:
G-protein coupled receptor
Mol. Mass.:
40761.85
Organism:
Rattus norvegicus (Rat)
Description:
Residue:
371
  
Inhibitor
Name:
BDBM50108498
Synonyms:
Biphenyl-2-carboxylic acid (4-{5-[2-(4-dimethylamino-piperidin-1-yl)-2-oxo-ethylidene]-4,4-difluoro-2,3,4,5-tetrahydro-benzo[b]azepine-1-carbonyl}-phenyl)-amide | CHEMBL307483
Type:
Small organic molecule
Emp. Form.:
C39H38F2N4O3
Mol. Mass.:
648.7408
SMILES:
CN(C)C1CCN(CC1)C(=O)\C=C1\c2ccccc2N(CCC1(F)F)C(=O)c1ccc(NC(=O)c2ccccc2-c2ccccc2)cc1
: