Target
Progesterone receptor
Ligand
BDBM50062430
Substrate
Meas. Tech.
ChEMBL_159864 (CHEMBL765239)
Ki
0.48±n/a nM
Citation
 Edwards, JPZhi, LPooley, CLTegley, CMWest, SJWang, MWGottardis, MMPathirana, CSchrader, WTJones, TK Preparation, resolution, and biological evaluation of 5-aryl-1, 2-dihydro-5H-chromeno[3,4-f]quinolines: potent, orally active, nonsteroidal progesterone receptor agonists. J Med Chem 41:2779-85 (1998)  
Target
Name:
Progesterone receptor
Synonyms:
NR3C3 PGR PRGR_HUMAN | progesterone
Type:
Protein
Mol. Mass.:
98979.52
Organism:
Homo sapiens (Human)
Description:
P06401
Residue:
933
  
Inhibitor
Name:
BDBM50062430
Synonyms:
9-Chloro-5-(3-chloro-phenyl)-2,2,4-trimethyl-2,5-dihydro-1H-6-oxa-1-aza-chrysene | CHEMBL104183
Type:
Small organic molecule
Emp. Form.:
C25H21Cl2NO
Mol. Mass.:
422.346
SMILES:
CC1=CC(C)(C)Nc2ccc3-c4cc(Cl)ccc4OC(c4cccc(Cl)c4)c3c12
: