Target
Vasopressin V1b receptor
Ligand
BDBM50145108
Substrate
Meas. Tech.
ChEMBL_214687 (CHEMBL817650)
Ki
0.780±n/a nM
Citation
 Cheng, LLStoev, SManning, MDerick, SPena, AMimoun, MBGuillon, G Design of potent and selective agonists for the human vasopressin V1b receptor based on modifications of [deamino-cys1]arginine vasopressin at position 4. J Med Chem 47:2375-88 (2004)  
Target
Name:
Vasopressin V1b receptor
Synonyms:
AVPR V1b AVPR1B Antidiuretic hormone receptor 1b V1bR VPR3 Vasopressin V1b receptor (V1b) Vasopressin V3 receptor
Type:
Enzyme
Mol. Mass.:
46985.01
Organism:
Homo sapiens (Human)
Description:
P47901
Residue:
424
  
Inhibitor
Name:
BDBM50145108
Synonyms:
(2S)-2-{[(2R)-1-{[(4S,7R,13R,16S)-13-benzyl-7-(carbamoylmethyl)-16-[(4-hydroxyphenyl)methyl]-6,9,12,15,18-pentaoxo-10-propyl-1,2-dithia-5,8,11,14,17-pentaazacycloicosan-4-yl]carbonyl}pyrrolidin-2-yl]formamido}-N-(carbamoylmethyl)-5-[(diaminomethylidene)amino]pentanamide | CHEMBL411013
Type:
Small organic molecule
Emp. Form.:
C46H65N13O11S2
Mol. Mass.:
1040.219
SMILES:
CCCC1NC(=O)[C@@H](Cc2ccccc2)NC(=O)[C@H](Cc2ccc(O)cc2)NC(=O)CCSSC[C@@H](NC(=O)[C@@H](CC(N)=O)NC1=O)C(=O)N1CCC[C@@H]1C(=O)N[C@@H](CCCNC(N)=N)C(=O)NCC(N)=O
: