Target
Acetylcholine receptor subunit alpha/beta/delta/gamma
Ligand
BDBM50166908
Substrate
Meas. Tech.
ChEMBL_303631 (CHEMBL828841)
Ki
3540±n/a nM
Citation
 Coe, JWBrooks, PRVetelino, MGWirtz, MCArnold, EPHuang, JSands, SBDavis, TILebel, LAFox, CBShrikhande, AHeym, JHSchaeffer, ERollema, HLu, YMansbach, RSChambers, LKRovetti, CCSchulz, DWTingley, FDO'Neill, BT Varenicline: an alpha4beta2 nicotinic receptor partial agonist for smoking cessation. J Med Chem 48:3474-7 (2005)  
Target
Name:
Acetylcholine receptor subunit alpha/beta/delta/gamma
Synonyms:
Acetylcholine receptor | Acetylcholine receptor protein alpha/beta/delta/gamma chain
Type:
Mol. Mass.:
Description:
ASSAY_ID of EBI is 143080
Components:
This complex has 4 components.
Component 1
Name:
Acetylcholine receptor subunit beta
Synonyms:
ACHB_TETCF CHRNB1
Type:
PROTEIN
Mol. Mass.:
56146.98
Organism:
Torpedo californica
Description:
EBI_19626
Residue:
493
  
Component 2
Name:
Acetylcholine receptor subunit gamma
Synonyms:
ACHG_TETCF CHRNG
Type:
PROTEIN
Mol. Mass.:
58151.68
Organism:
Torpedo californica
Description:
EBI_19662
Residue:
506
  
Component 3
Name:
Acetylcholine receptor subunit alpha
Synonyms:
ACHA_TETCF Acetylcholine receptor protein alpha chain | CHRNA1
Type:
PROTEIN
Mol. Mass.:
52735.09
Organism:
Torpedo californica
Description:
ChEMBL_216981
Residue:
461
  
Component 4
Name:
Acetylcholine receptor subunit delta
Synonyms:
ACHD_TETCF Acetylcholine receptor protein delta chain | chrnd
Type:
PROTEIN
Mol. Mass.:
59885.01
Organism:
Torpedo californica
Description:
ChEMBL_142744
Residue:
522
  
Inhibitor
Name:
BDBM50166908
Synonyms:
5,8,14-triazatetracyclo[10.3.1.02,11.04,9]hexadeca-2(11),3,5,7,9-pentaene; dihydrochloride US9993465, Varenicline | VARENICLINE
Type:
Small organic molecule
Emp. Form.:
C13H13N3
Mol. Mass.:
211.2624
SMILES:
C1C2CNCC1c1cc3nccnc3cc21
: