Target
Adenosine deaminase
Ligand
BDBM28393
Substrate
Meas. Tech.
ChEMBL_302877 (CHEMBL828791)
Ki
1.14±n/a nM
Citation
 Da Settimo, FPrimofiore, GLa Motta, CTaliani, SSimorini, FMarini, AMMugnaini, LLavecchia, ANovellino, ETuscano, DMartini, C Novel, highly potent adenosine deaminase inhibitors containing the pyrazolo[3,4-d]pyrimidine ring system. Synthesis, structure-activity relationships, and molecular modeling studies. J Med Chem 48:5162-74 (2005)  
Target
Name:
Adenosine deaminase
Synonyms:
ADA Adenosine aminohydrolase
Type:
Enzyme
Mol. Mass.:
40910.44
Organism:
Bos taurus (bovine)
Description:
Residue:
363
  
Inhibitor
Name:
BDBM28393
Synonyms:
(+)-EHNA CHEMBL296435
Type:
Small organic molecule
Emp. Form.:
C14H23N5O
Mol. Mass.:
277.3653
SMILES:
CCCCCC[C@H]([C@H](C)O)n1cnc2c(N)ncnc12
: