Target
Plasmepsin II
Ligand
BDBM50390633
Substrate
Meas. Tech.
ChEMBL_835449 (CHEMBL2072155)
Ki
2.3±n/a nM
Citation
 Vaiana, NMarzahn, MParapini, SLiu, PDell'Agli, MPancotti, ASangiovanni, EBasilico, NBosisio, EDunn, BMTaramelli, DRomeo, S Antiplasmodial activities of 4-aminoquinoline-statine compounds. Bioorg Med Chem Lett 22:5915-8 (2012)  
Target
Name:
Plasmepsin II
Synonyms:
Aspartic hemoglobinase II PLM2_PLAFX Plasmepsin 2 Plasmepsin-II
Type:
Enzyme
Mol. Mass.:
51482.09
Organism:
Plasmodium falciparum
Description:
P46925
Residue:
453
  
Inhibitor
Name:
BDBM50390633
Synonyms:
CHEMBL2069612
Type:
Small organic molecule
Emp. Form.:
C44H57ClN6O6
Mol. Mass.:
801.413
SMILES:
CCCCNC(=O)C[C@H](O)[C@H](CC(C)C)NC(=O)[C@@H](NC(=O)c1ccc(Oc2ccc(cc2)C(=O)NCCCNc2ccnc3cc(Cl)ccc23)cc1)[C@@H](C)CC
: