Target
Ribonuclease pancreatic
Ligand
BDBM50391853
Substrate
Meas. Tech.
ChEMBL_850487 (CHEMBL2150674)
Kd
3100±n/a nM
Citation
 Ellis, GAHornung, MLRaines, RT Potentiation of ribonuclease cytotoxicity by a poly(amidoamine) dendrimer. Bioorg Med Chem Lett 21:2756-8 (2011)  
Target
Name:
Ribonuclease pancreatic
Synonyms:
CAM-RNase A RNASE1 RNS1
Type:
Enzyme
Mol. Mass.:
16468.79
Organism:
Bison bison (American bison)
Description:
carboxamidomethylated RNase A
Residue:
150
  
Inhibitor
Name:
BDBM50391853
Synonyms:
CHEMBL2147156
Type:
Small organic molecule
Emp. Form.:
C142H288N58O28
Mol. Mass.:
3256.1779
SMILES:
NCCNC(=O)CCN(CCNC(=O)CCN(CCNC(=O)CCN(CCN(CCC(=O)NCCN(CCC(=O)NCCN(CCC(=O)NCCN)CCC(=O)NCCN)CCC(=O)NCCN(CCC(=O)NCCN)CCC(=O)NCCN)CCC(=O)NCCN(CCC(=O)NCCN(CCC(=O)NCCN)CCC(=O)NCCN)CCC(=O)NCCN(CCC(=O)NCCN)CCC(=O)NCCN)CCC(=O)NCCN(CCC(=O)NCCN(CCC(=O)NCCN)CCC(=O)NCCN)CCC(=O)NCCN(CCC(=O)NCCN)CCC(=O)NCCN)CCC(=O)NCCN(CCC(=O)NCCN)CCC(=O)NCCN)CCC(=O)NCCN
: