Target
Tyrosine-protein kinase BTK
Ligand
BDBM50399460
Substrate
Meas. Tech.
ChEMBL_878238 (CHEMBL2185026)
IC50
5±n/a nM
Citation
 Zapf, CWGerstenberger, BSXing, LLimburg, DCAnderson, DRCaspers, NHan, SAulabaugh, AKurumbail, RShakya, SLi, XSpaulding, VCzerwinski, RMSeth, NMedley, QG Covalent inhibitors of interleukin-2 inducible T cell kinase (itk) with nanomolar potency in a whole-blood assay. J Med Chem 55:10047-63 (2012)  
Target
Name:
Tyrosine-protein kinase BTK
Synonyms:
AGMX1 Agammaglobulinaemia tyrosine kinase B cell progenitor kinase BPK BTK_HUMAN Tyrosine Kinase BTK Tyrosine-protein kinase BTK (BTK)
Type:
Enzyme
Mol. Mass.:
76289.95
Organism:
Homo sapiens (Human)
Description:
Q06187
Residue:
659
  
Inhibitor
Name:
BDBM50399460
Synonyms:
CHEMBL2179804
Type:
Small organic molecule
Emp. Form.:
C29H31N7O2
Mol. Mass.:
509.6021
SMILES:
CC(C)c1ccc(NC(=O)c2cccc(c2)-c2nn([C@@H]3CCCN(C3)C(=O)C=C)c3ncnc(N)c23)cc1
: