Target
Serine/threonine-protein kinase Chk1
Ligand
BDBM91906
Substrate
Meas. Tech.
ChEMBL_570759 (CHEMBL1026934)
Ki
1.3±n/a nM
Citation
 Brown, SPMuchmore, SW Large-scale application of high-throughput molecular mechanics with Poisson-Boltzmann surface area for routine physics-based scoring of protein-ligand complexes. J Med Chem 52:3159-65 (2009)  
Target
Name:
Serine/threonine-protein kinase Chk1
Synonyms:
CHEK1 CHK1 checkpoint homolog Checkpoint kinase-1 (CHK1)
Type:
Enzyme Catalytic Domain
Mol. Mass.:
54443.02
Organism:
Homo sapiens (Human)
Description:
gi_166295192
Residue:
476
  
Inhibitor
Name:
BDBM91906
Synonyms:
Chk1_40
Type:
Emp. Form.:
C17H17BrN6O2
Mol. Mass.:
417.26
SMILES:
OC1CCCN(C1)c1ccc(Br)cc1NC(=O)Nc1cnc(cn1)C#N
: