Target
Serine/threonine-protein kinase Chk1
Ligand
BDBM50414226
Substrate
Meas. Tech.
ChEMBL_570759 (CHEMBL1026934)
Ki
1.6±n/a nM
Citation
 Brown, SPMuchmore, SW Large-scale application of high-throughput molecular mechanics with Poisson-Boltzmann surface area for routine physics-based scoring of protein-ligand complexes. J Med Chem 52:3159-65 (2009)  
Target
Name:
Serine/threonine-protein kinase Chk1
Synonyms:
CHEK1 CHK1 checkpoint homolog Checkpoint kinase-1 (CHK1)
Type:
Enzyme Catalytic Domain
Mol. Mass.:
54443.02
Organism:
Homo sapiens (Human)
Description:
gi_166295192
Residue:
476
  
Inhibitor
Name:
BDBM50414226
Synonyms:
CHEMBL558077
Type:
Small organic molecule
Emp. Form.:
C24H23N3O5
Mol. Mass.:
433.4565
SMILES:
COc1cc(ccc1[N+]([O-])=O)-c1ccc2c(Nc3ccc(cc3NC2=O)C(C)(C)CO)c1
: