Target
Serine/threonine-protein kinase Chk1
Ligand
BDBM50414229
Substrate
Meas. Tech.
ChEMBL_570759 (CHEMBL1026934)
Ki
4±n/a nM
Citation
 Brown, SPMuchmore, SW Large-scale application of high-throughput molecular mechanics with Poisson-Boltzmann surface area for routine physics-based scoring of protein-ligand complexes. J Med Chem 52:3159-65 (2009)  
Target
Name:
Serine/threonine-protein kinase Chk1
Synonyms:
CHEK1 CHK1 checkpoint homolog Checkpoint kinase-1 (CHK1)
Type:
Enzyme Catalytic Domain
Mol. Mass.:
54443.02
Organism:
Homo sapiens (Human)
Description:
gi_166295192
Residue:
476
  
Inhibitor
Name:
BDBM50414229
Synonyms:
CHEMBL560210
Type:
Small organic molecule
Emp. Form.:
C16H11N5O2
Mol. Mass.:
305.2908
SMILES:
Oc1cc2ccccc2cc1NC(=O)Nc1cnc(cn1)C#N
: