Target
Acid ceramidase
Ligand
BDBM29080
Substrate
Meas. Tech.
ChEMBL_949260 (CHEMBL2346136)
Ki
500000±n/a nM
Citation
 Pizzirani, DPagliuca, CRealini, NBranduardi, DBottegoni, GMor, MBertozzi, FScarpelli, RPiomelli, DBandiera, T Discovery of a new class of highly potent inhibitors of acid ceramidase: synthesis and structure-activity relationship (SAR). J Med Chem 56:3518-30 (2013)  
Target
Name:
Acid ceramidase
Synonyms:
ASAH ASAH1_HUMAN Acid ceramidase (AC)
Type:
Enzyme
Mol. Mass.:
44662.65
Organism:
Homo sapiens (Human)
Description:
Q13510
Residue:
395
  
Inhibitor
Name:
BDBM29080
Synonyms:
CHEMBL280065 Oleamide MEA Oleoylethanolamide (OEA)
Type:
Emp. Form.:
C20H39NO2
Mol. Mass.:
325.5292
SMILES:
CCCCCCCC\C=C/CCCCCCCC(=O)NCCO
: