Target
Lethal(3)malignant brain tumor-like protein 3
Ligand
BDBM50440565
Substrate
Meas. Tech.
ChEMBL_983410 (CHEMBL2429080)
IC50
130±n/a nM
Citation
 James, LIKorboukh, VKKrichevsky, LBaughman, BMHerold, JMNorris, JLJin, JKireev, DBJanzen, WPArrowsmith, CHFrye, SV Small-molecule ligands of methyl-lysine binding proteins: optimization of selectivity for L3MBTL3. J Med Chem 56:7358-71 (2013)  
Target
Name:
Lethal(3)malignant brain tumor-like protein 3
Synonyms:
H-l(3)mbt-like protein 3 L(3)mbt-like protein 3 LMBL3_HUMAN Lethal(3)malignant brain tumor-like protein 3 (L3MBTL3) MBT1
Type:
Protein
Mol. Mass.:
88334.17
Organism:
Homo sapiens (Human)
Description:
Residue:
780
  
Inhibitor
Name:
BDBM50440565
Synonyms:
CHEMBL2426358
Type:
Small organic molecule
Emp. Form.:
C26H34F4N4O2
Mol. Mass.:
510.5674
SMILES:
Fc1c(F)c(C(=O)N2CCC(CC2)N2CCCC2)c(F)c(F)c1C(=O)N1CCC(CC1)N1CCCC1
: