Target
Lethal(3)malignant brain tumor-like protein 3
Ligand
BDBM50440569
Substrate
Meas. Tech.
ChEMBL_983410 (CHEMBL2429080)
IC50
61±n/a nM
Citation
 James, LIKorboukh, VKKrichevsky, LBaughman, BMHerold, JMNorris, JLJin, JKireev, DBJanzen, WPArrowsmith, CHFrye, SV Small-molecule ligands of methyl-lysine binding proteins: optimization of selectivity for L3MBTL3. J Med Chem 56:7358-71 (2013)  
Target
Name:
Lethal(3)malignant brain tumor-like protein 3
Synonyms:
H-l(3)mbt-like protein 3 L(3)mbt-like protein 3 LMBL3_HUMAN Lethal(3)malignant brain tumor-like protein 3 (L3MBTL3) MBT1
Type:
Protein
Mol. Mass.:
88334.17
Organism:
Homo sapiens (Human)
Description:
Residue:
780
  
Inhibitor
Name:
BDBM50440569
Synonyms:
CHEMBL2424678
Type:
Small organic molecule
Emp. Form.:
C25H37N5O2
Mol. Mass.:
439.5936
SMILES:
O=C(N1CCC(CC1)N1CCCC1)c1ccc(nc1)C(=O)N1CCC(CC1)N1CCCC1
: