Target
Isoform 4 of Lethal(3)malignant brain tumor-like protein 1 (4)
Ligand
BDBM50440607
Substrate
Meas. Tech.
ChEMBL_983408 (CHEMBL2429078)
IC50
>10000±n/a nM
Citation
 James, LIKorboukh, VKKrichevsky, LBaughman, BMHerold, JMNorris, JLJin, JKireev, DBJanzen, WPArrowsmith, CHFrye, SV Small-molecule ligands of methyl-lysine binding proteins: optimization of selectivity for L3MBTL3. J Med Chem 56:7358-71 (2013)  
Target
Name:
Isoform 4 of Lethal(3)malignant brain tumor-like protein 1 (4)
Synonyms:
H-l(3)mbt KIAA0681 L(3)mbt-like L3MBTL LMBL1_HUMAN Lethal(3)malignant brain tumor-like protein 1 (4) | Lethal(3)malignant brain tumor-like protein 1 (L3MBTL1)
Type:
Protein
Mol. Mass.:
83871.06
Organism:
Homo sapiens (Human)
Description:
Q9Y468-4
Residue:
752
  
Inhibitor
Name:
BDBM50440607
Synonyms:
CHEMBL2426375
Type:
Small organic molecule
Emp. Form.:
C27H34N4O2
Mol. Mass.:
446.5845
SMILES:
CCN1Cc2ccc(NC(=O)c3ccc(cc3)C(=O)N3CCC(CC3)C3CCCN3)cc2C1
: