Target
PHD finger protein 23
Ligand
BDBM50341828
Substrate
Meas. Tech.
ChEMBL_983401 (CHEMBL2429071)
IC50
>10000±n/a nM
Citation
 James, LIKorboukh, VKKrichevsky, LBaughman, BMHerold, JMNorris, JLJin, JKireev, DBJanzen, WPArrowsmith, CHFrye, SV Small-molecule ligands of methyl-lysine binding proteins: optimization of selectivity for L3MBTL3. J Med Chem 56:7358-71 (2013)  
Target
Name:
PHD finger protein 23
Synonyms:
PDH-containing protein JUNE-1 PHD finger protein 23 (PHF23) PHF23_HUMAN
Type:
Protein
Mol. Mass.:
43813.67
Organism:
Homo sapiens (Human)
Description:
Residue:
403
  
Inhibitor
Name:
BDBM50341828
Synonyms:
3-bromo-5-[(4-pyrrolidin-1-ylpiperidin-1-yl)carbonyl]pyridine CHEMBL1235119
Type:
Small organic molecule
Emp. Form.:
C15H20BrN3O
Mol. Mass.:
338.243
SMILES:
Brc1cncc(c1)C(=O)N1CCC(CC1)N1CCCC1
: