Target
E3 ubiquitin-protein ligase UHRF1
Ligand
BDBM50440599
Substrate
Meas. Tech.
ChEMBL_983403 (CHEMBL2429073)
IC50
>10000±n/a nM
Citation
 James, LIKorboukh, VKKrichevsky, LBaughman, BMHerold, JMNorris, JLJin, JKireev, DBJanzen, WPArrowsmith, CHFrye, SV Small-molecule ligands of methyl-lysine binding proteins: optimization of selectivity for L3MBTL3. J Med Chem 56:7358-71 (2013)  
Target
Name:
E3 ubiquitin-protein ligase UHRF1
Synonyms:
6.3.2.- E3 ubiquitin-protein ligase UHRF1 ICBP90 NP95 Nuclear zinc finger protein Np95 RNF106 UHRF1 Ubiquitin-like PHD and RING finger domain-containing protein 1 hNp95 | hUHRF1
Type:
Protein
Mol. Mass.:
89822.48
Organism:
Homo sapiens (Human)
Description:
Residue:
793
  
Inhibitor
Name:
BDBM50440599
Synonyms:
CHEMBL2426482
Type:
Small organic molecule
Emp. Form.:
C25H38N4O
Mol. Mass.:
410.5954
SMILES:
O=C(N1CCC(CC1)N1CCCC1)c1ccc(cc1)N1CCC(CC1)N1CCCC1
: