Target
TP53-binding protein 1
Ligand
BDBM50440607
Substrate
Meas. Tech.
ChEMBL_983402 (CHEMBL2429072)
IC50
>10000±n/a nM
Citation
 James, LIKorboukh, VKKrichevsky, LBaughman, BMHerold, JMNorris, JLJin, JKireev, DBJanzen, WPArrowsmith, CHFrye, SV Small-molecule ligands of methyl-lysine binding proteins: optimization of selectivity for L3MBTL3. J Med Chem 56:7358-71 (2013)  
Target
Name:
TP53-binding protein 1
Synonyms:
53BP1 TP53BP1 Tumor suppressor p53-binding protein 1 p53BP1
Type:
PROTEIN
Mol. Mass.:
213442.98
Organism:
Homo sapiens (Human)
Description:
ChEMBL_107658
Residue:
1972
  
Inhibitor
Name:
BDBM50440607
Synonyms:
CHEMBL2426375
Type:
Small organic molecule
Emp. Form.:
C27H34N4O2
Mol. Mass.:
446.5845
SMILES:
CCN1Cc2ccc(NC(=O)c3ccc(cc3)C(=O)N3CCC(CC3)C3CCCN3)cc2C1
: