Target
Histamine H3 receptor
Ligand
BDBM50441511
Substrate
Meas. Tech.
ChEMBL_988451 (CHEMBL2437993)
Ki
2.0±n/a nM
Citation
 de Lera Ruiz, MZheng, JBerlin, MYMcCormick, KDAslanian, RGWest, RHwa, JLachowicz, Jvan Heek, M Bicyclic and tricyclic heterocycle derivatives as histamine H3 receptor antagonists for the treatment of obesity. Bioorg Med Chem Lett 23:6004-9 (2013)  
Target
Name:
Histamine H3 receptor
Synonyms:
HH3R Hrh3
Type:
PROTEIN
Mol. Mass.:
48560.37
Organism:
Mus musculus
Description:
ChEMBL_988451
Residue:
445
  
Inhibitor
Name:
BDBM50441511
Synonyms:
CHEMBL2436620
Type:
Small organic molecule
Emp. Form.:
C26H33FN8OS
Mol. Mass.:
524.657
SMILES:
Cc1nnc2CN(Cc3ccsc3-n12)C1CCN(CC1)C(=O)C1(F)CCN(Cc2ccnc(N)c2)CC1
: