Target
Acrosin
Ligand
BDBM50010126
Substrate
Meas. Tech.
ChEMBL_1344334 (CHEMBL3257004)
Ki
260±n/a nM
Citation
 Parrish, RFStraus, JWPaulson, JDPolakoski, KLTidwell, RRGeratz, JDStevens, FM Structure-activity relationships for the inhibition of acrosin by benzamidine derivatives. J Med Chem 21:1132-6 (1979)  
Target
Name:
Acrosin
Synonyms:
53 kDa fucose-binding protein ACRO_PIG Acrosin light chain
Type:
PROTEIN
Mol. Mass.:
45383.66
Organism:
Sus scrofa
Description:
ChEMBL_108297
Residue:
415
  
Inhibitor
Name:
BDBM50010126
Synonyms:
CHEMBL3245414
Type:
Small organic molecule
Emp. Form.:
C24H32Br2N4O2
Mol. Mass.:
568.344
SMILES:
NC(=N)c1ccc(OCCCCCCCCCCOc2ccc(cc2Br)C(N)=N)c(Br)c1
: