Target
Integrase
Ligand
BDBM50011005
Substrate
Meas. Tech.
ChEMBL_1351354 (CHEMBL3266567)
Kd
280±n/a nM
Citation
Target
Name:
Integrase
Synonyms:
Human immunodeficiency virus type 1 integrase
Type:
PROTEIN
Mol. Mass.:
32231.48
Organism:
Human immunodeficiency virus 1
Description:
ChEMBL_90865
Residue:
288
  
Inhibitor
Name:
BDBM50011005
Synonyms:
CHEMBL3259894
Type:
Small organic molecule
Emp. Form.:
C21H19BrClNO3
Mol. Mass.:
448.737
SMILES:
CC(C)O[C@H](C(O)=O)c1c(C)nc2ccc(Br)cc2c1-c1ccc(Cl)cc1
: